﻿"Dublin Core:Title","Dublin Core:Creator","Dublin Core:Contributor","Dublin Core:Date","Dublin Core:Type","Dublin Core:Format","Dublin Core:Language","Dublin Core:Subject","Dublin Core:Description","Dublin Core:Source","Dublin Core:Abstract","Dublin Core:Spatial Coverage","Dublin Core:Publisher","Dublin Core:Provenance","Dublin Core:Rights","Dublin Core:Relation","Dublin Core:Identifier","Dublin Core:Coverage","Dublin Core:Alternative Title","Dublin Core:Table Of Contents","Dublin Core:Date Available","Dublin Core:Date Created","Dublin Core:Date Accepted","Dublin Core:Date Copyrighted","Dublin Core:Date Submitted","Dublin Core:Date Issued","Dublin Core:Date Modified","Dublin Core:Date Valid","Dublin Core:Access Rights","Dublin Core:License","Dublin Core:Conforms To","Dublin Core:Has Format","Dublin Core:Has Part","Dublin Core:Has Version","Dublin Core:Is Format Of","Dublin Core:Is Part Of","Dublin Core:Is Referenced By","Dublin Core:Is Replaced By","Dublin Core:Is Required By","Dublin Core:Is Version Of","Dublin Core:References","Dublin Core:Replaces","Dublin Core:Requires","Dublin Core:Extent","Dublin Core:Medium","Dublin Core:Bibliographic Citation","Dublin Core:Temporal Coverage","Dublin Core:Accrual Method","Dublin Core:Accrual Periodicity","Dublin Core:Accrual Policy","Dublin Core:Audience","Dublin Core:Audience Education Level","Dublin Core:Mediator","Dublin Core:Instructional Method","Dublin Core:Rights Holder","Item Type Metadata:Text","Item Type Metadata:Interviewer","Item Type Metadata:Interviewee","Item Type Metadata:Location","Item Type Metadata:Transcription","Item Type Metadata:URL local","Item Type Metadata:Format original","Item Type Metadata:Dimensions físiques","Item Type Metadata:Duration","Item Type Metadata:Compression","Item Type Metadata:Producer","Item Type Metadata:Director","Item Type Metadata:Bit Rate/Frequency","Item Type Metadata:Time Summary","Item Type Metadata:Email Body","Item Type Metadata:Subject Line","Item Type Metadata:From","Item Type Metadata:To","Item Type Metadata:CC","Item Type Metadata:BCC","Item Type Metadata:Number of Attachments","Item Type Metadata:Standards","Item Type Metadata:Objectives","Item Type Metadata:Materials","Item Type Metadata:Lesson Plan Text","Item Type Metadata:URL","Item Type Metadata:Event Type","Item Type Metadata:Participants","Item Type Metadata:Birth Date","Item Type Metadata:Birthplace","Item Type Metadata:Death Date","Item Type Metadata:Occupation","Item Type Metadata:Biographical Text","Item Type Metadata:Bibliography","Item Type Metadata:Edition Statement","Item Type Metadata:Publication Statement","Item Type Metadata:Note statement","Item Type Metadata:Profile description : Creation","Item Type Metadata:Profile description : Descriptive Rules","Item Type Metadata:Profile description : Language Usage","Item Type Metadata:Revision Description : Change","Item Type Metadata:Revision Description : List","Item Type Metadata:Front matter : Title page","Item Type Metadata:Front matter : Division","Item Type Metadata:Destinatari","Item Type Metadata:Número de caixa","Item Type Metadata:Localització de la caixa","EAD Archive:Level","EAD Archive:Arrangement","EAD Archive:Descriptive Identification : Heading","EAD Archive:Descriptive Identification : Note","EAD Archive:Appraisal Information","EAD Archive:Biography or History","EAD Archive:Index","EAD Archive:Note","EAD Archive:Other Descriptive Data","EAD Archive:Processing Information","EAD Archive:Scope and Content","EAD Archive:Heading","EAD Archive:Table Head","PDF Text:Text",tags,file,itemType,collection,public,featured
"Diez años fomentando la pluralidad","Maragall, Pasqual, 1941-",,2005-10-06,Article,Textual,Castellà,Periodisme,,"El Mundo",,,,,,,1336,,,,,,,,,,,,,,,,,,,,,,,,,,,,,,,,,,,,,,,,,,,,,,,,,,,,,,,,,,,,,,,,,,,,,,,,,,,,,,,,,,,,,,Document,,,,,,,,,,,,,,Articles,https://arxiupmaragall.catalunyaeuropa.net/files/original/27/1679/0000000642.pdf,,"12.01. Activitat de representació (com a President)",1,0
"Catalunya ha parlat","Maragall, Pasqual, 1941-",,2005-10-02,Article,Textual,Català,Estatut,,"El Periódico de Catalunya",,,,,,,1337,,,,,,,,,,,,,,,,,,,,,,,,,,,,,,,,,,,,,,,,,,,,,,,,,,,,,,,,,,,,,,,,,,,,,,,,,,,,,,,,,,,,,,Document,,,,,,,,,,,,,,Articles,https://arxiupmaragall.catalunyaeuropa.net/files/original/27/1680/0000000643.pdf,,"12.01. Activitat de representació (com a President)",1,0
"Reforma estatutaria: declaración íntegra del president","Maragall, Pasqual, 1941-",,2005-09-25,Article,Textual,Castellà,Estatut,,"El Periódico de Catalunya",,,,,,,,,,,,,,,,,,,,,,,,,,,,,,,,,,,,,,,,,,,,,,,,,,,,,,,,,,,,,,,,,,,,,,,,,,,,,,,,,,,,,,,,,,,,,Document,,,,,,,,,,,,,,Articles,https://arxiupmaragall.catalunyaeuropa.net/files/original/27/1728/0000001575.pdf,,"12.01. Activitat de representació (com a President)",1,0
"Carta oberta sobre la reforma estatutària","Maragall, Pasqual, 1941-",,2005-09-25,Article,Textual,Català,Estatut,,"El Periódico de Catalunya","El president de la Generalitat, Pasqual Maragall, va difondre ahir una carta oberta als catalans en la qual demana suport unànime al nou Estatut i promet vetllar perquè ningú trenqui, amb propostes inconstitucionals, «el somni» d’un millor autogovern.",,,,,,,,,,,,,,,,,,,,,,,,,,,,,,,,,,,,,,,,,,,,,,,,,,,,,,,,,,,,,,,,,,,,,,,,,,,,,,,,,,,,,,,,,,,,Document,,,,,,,,,,,,,,Articles,https://arxiupmaragall.catalunyaeuropa.net/files/original/27/1729/0000001574.pdf,,"12.01. Activitat de representació (com a President)",1,0
"Carta oberta del president als ciutadans i ciutadanes de Catalunya","Maragall, Pasqual, 1941-",,2005-09-25,Article,Textual,Català,Estatut,,"La Vanguardia",,,,,,,1232,,,,,,,,,,,,,,,,,,,,,,,,,,,,,,,,,,,,,,,,,,,,,,,,,,,,,,,,,,,,,,,,,,,,,,,,,,,,,,,,,,,,,,Document,,,"President de la Generalitat de Catalunya",,,,,,,,,,,Articles,https://arxiupmaragall.catalunyaeuropa.net/files/original/27/761/20050925_LV.pdf,,"12.01. Activitat de representació (com a President)",1,0
"Catalunya ha de tornar a mirar lluny","Maragall, Pasqual, 1941-",,2005-09-11,Article,Textual,Català,Estatut,,Avui,,,,,,,1338,,,,,,,,,,,,,,,,,,,,,,,,,,,,,,,,,,,,,,,,,,,,,,,,,,,,,,,,,,,,,,,,,,,,,,,,,,,,,,,,,,,,,,Document,,,,,,,,,,,,,,Articles,https://arxiupmaragall.catalunyaeuropa.net/files/original/27/1681/0000000644.pdf,,"12.01. Activitat de representació (com a President)",1,0
"Convencer o conllevarse, federalismo o nacionalismo","Maragall, Pasqual, 1941-",,2005-08-28,Article,Textual,Castellà,Federalisme,,"El País","El autor aboga por profundizar las relaciones entre los pueblos de España por el camino del federalismo pluralista y la convivencia. Maragall apuesta abiertamente por superar la visión y la práctica política que han caracterizado las relaciones establecidas por los nacionalistas españoles y catalanes durante los últimos 100 años, que, a su juicio, se han limitado a conllevarse y a mantener una relación educada. Propugna superar el modelo desarrollado por González, Aznar y Pujol y explicita un marco de relaciones más ambicioso entre Cataluña y España. Para el presidente de la Generalitat, lo que quiere Cataluña es una España de corte federal, en la que puedan coincidir los federalistas y los soberanistas.",,,,,,1121,,,,,,,,,,,,,,,,,,,,,,,,,,,,,,,,,,,,,,,,,,,,,,,,,,,,,,,,,,,,,,,,,,,,,,,,,,,,,,,,,,,,,,Document,,,,,,,,,,,,,,Articles,https://arxiupmaragall.catalunyaeuropa.net/files/original/27/874/0000001612.pdf,,"12.01. Activitat de representació (com a President)",1,0
"Candidness: últim adéu a Santiago Costa","Maragall, Pasqual, 1941-",,2005-07-27,Article,Textual,Català,"Costa, Santiago",,"La Vanguardia",,,,,,,1231,,,,,,,,,,,,,,,,,,,,,,,,,,,,,,,,,,,,,,,,,,,,,,,,,,,,,,,,,,,,,,,,,,,,,,,,,,,,,,,,,,,,,,Document,,,"President de la Generalitat de Catalunya",,,,,,,,,,,Articles,https://arxiupmaragall.catalunyaeuropa.net/files/original/27/760/20050727_LV.pdf,,"12.01. Activitat de representació (com a President)",1,0
"Deu anys de diàleg","Maragall, Pasqual, 1941-",,2005-07-11,Article,Textual,Català,"Mitjans de comunicació",,"El Periódico de Catalunya",,,,,,,,,,,,,,,,,,,,,,,,,,,,,,,,,,,,,,,,,,,,,,,,,,,,,,,,,,,,,,,,,,,,,,,,,,,,,,,,,,,,,,,,,,,,,Document,,,,,,,,,,,,,,Articles,https://arxiupmaragall.catalunyaeuropa.net/files/original/27/1730/0000001573.pdf,,"12.01. Activitat de representació (com a President)",1,0
"¡Suerte, Madrid!","Maragall, Pasqual, 1941-",,2005-07-06,Article,Textual,Castellà,"Jocs Olímpics",,"El País",,,,,,,1120,,,,,,,,,,,,,,,,,,,,,,,,,,,,,,,,,,,,,,,,,,,,,,,,,,,,,,,,,,,,,,,,,,,,,,,,,,,,,,,,,,,,,,Document,,,,,,,,,,,,,,Articles,https://arxiupmaragall.catalunyaeuropa.net/files/original/27/873/0000001564.pdf,,"12.01. Activitat de representació (com a President)",1,0
