﻿"Dublin Core:Title","Dublin Core:Creator","Dublin Core:Contributor","Dublin Core:Date","Dublin Core:Type","Dublin Core:Format","Dublin Core:Language","Dublin Core:Subject","Dublin Core:Description","Dublin Core:Source","Dublin Core:Abstract","Dublin Core:Spatial Coverage","Dublin Core:Publisher","Dublin Core:Provenance","Dublin Core:Rights","Dublin Core:Relation","Dublin Core:Identifier","Dublin Core:Coverage","Dublin Core:Alternative Title","Dublin Core:Table Of Contents","Dublin Core:Date Available","Dublin Core:Date Created","Dublin Core:Date Accepted","Dublin Core:Date Copyrighted","Dublin Core:Date Submitted","Dublin Core:Date Issued","Dublin Core:Date Modified","Dublin Core:Date Valid","Dublin Core:Access Rights","Dublin Core:License","Dublin Core:Conforms To","Dublin Core:Has Format","Dublin Core:Has Part","Dublin Core:Has Version","Dublin Core:Is Format Of","Dublin Core:Is Part Of","Dublin Core:Is Referenced By","Dublin Core:Is Replaced By","Dublin Core:Is Required By","Dublin Core:Is Version Of","Dublin Core:References","Dublin Core:Replaces","Dublin Core:Requires","Dublin Core:Extent","Dublin Core:Medium","Dublin Core:Bibliographic Citation","Dublin Core:Temporal Coverage","Dublin Core:Accrual Method","Dublin Core:Accrual Periodicity","Dublin Core:Accrual Policy","Dublin Core:Audience","Dublin Core:Audience Education Level","Dublin Core:Mediator","Dublin Core:Instructional Method","Dublin Core:Rights Holder","Item Type Metadata:Text","Item Type Metadata:Interviewer","Item Type Metadata:Interviewee","Item Type Metadata:Location","Item Type Metadata:Transcription","Item Type Metadata:URL local","Item Type Metadata:Format original","Item Type Metadata:Dimensions físiques","Item Type Metadata:Duration","Item Type Metadata:Compression","Item Type Metadata:Producer","Item Type Metadata:Director","Item Type Metadata:Bit Rate/Frequency","Item Type Metadata:Time Summary","Item Type Metadata:Email Body","Item Type Metadata:Subject Line","Item Type Metadata:From","Item Type Metadata:To","Item Type Metadata:CC","Item Type Metadata:BCC","Item Type Metadata:Number of Attachments","Item Type Metadata:Standards","Item Type Metadata:Objectives","Item Type Metadata:Materials","Item Type Metadata:Lesson Plan Text","Item Type Metadata:URL","Item Type Metadata:Event Type","Item Type Metadata:Participants","Item Type Metadata:Birth Date","Item Type Metadata:Birthplace","Item Type Metadata:Death Date","Item Type Metadata:Occupation","Item Type Metadata:Biographical Text","Item Type Metadata:Bibliography","Item Type Metadata:Edition Statement","Item Type Metadata:Publication Statement","Item Type Metadata:Note statement","Item Type Metadata:Profile description : Creation","Item Type Metadata:Profile description : Descriptive Rules","Item Type Metadata:Profile description : Language Usage","Item Type Metadata:Revision Description : Change","Item Type Metadata:Revision Description : List","Item Type Metadata:Front matter : Title page","Item Type Metadata:Front matter : Division","Item Type Metadata:Destinatari","Item Type Metadata:Número de caixa","Item Type Metadata:Localització de la caixa","EAD Archive:Level","EAD Archive:Arrangement","EAD Archive:Descriptive Identification : Heading","EAD Archive:Descriptive Identification : Note","EAD Archive:Appraisal Information","EAD Archive:Biography or History","EAD Archive:Index","EAD Archive:Note","EAD Archive:Other Descriptive Data","EAD Archive:Processing Information","EAD Archive:Scope and Content","EAD Archive:Heading","EAD Archive:Table Head","PDF Text:Text",tags,file,itemType,collection,public,featured
"L'Europa de les ciutats","Maragall, Pasqual, 1941-",,1988,Article,Textual,Català,Europa,"4p. Núm. 10/11, 2/3 - Vol. III. Dossier: L'esquerra per la unitat europea.","L'Opinió socialista",,,,,,,,,,,,,,,,,,,,,,,,,,,,,,,,,,,,,,,,,,,,,,,,,,,,,,,,,,,,,,,,,,,,,,,,,,,,,,,,,,,,,,,,,,,,,Document,FCE,,,,,,,,,,,,,Articles,https://arxiupmaragall.catalunyaeuropa.net/files/original/30/2793/1988_n10_11_OpinioSocialista_LEuropaCiutats_PM_OCR.pdf,,"09.01. Activitat de representació (com a Alcalde)",1,0
"Barcelona se esfuerza por conseguir un memorable 92","Maragall, Pasqual, 1941-",,1988-10-01,Article,Textual,Castellà,"Jocs Olímpics",,"La Vanguardia",,,,,,,1147,,,,,,,,,,,,,,,,,,,,,,,,,,,,,,,,,,,,,,,,,,,,,,,,,,,,,,,,,,,,,,,,,,,,,,,,,,,,,,,,,,,,,,Document,,,"Alcalde de Barcelona",,,,,,,,,,,Articles,https://arxiupmaragall.catalunyaeuropa.net/files/original/30/685/19881001_LV.pdf,,"09.01. Activitat de representació (com a Alcalde)",1,0
"Barcelona endins","Maragall, Pasqual, 1941-",,1989-05-09,Article,Textual,Castellà,Barcelona,,"La Vanguardia",,,,,,,1148,,,,,,,,,,,,,,,,,,,,,,,,,,,,,,,,,,,,,,,,,,,,,,,,,,,,,,,,,,,,,,,,,,,,,,,,,,,,,,,,,,,,,,Document,,,"Alcalde de Barcelona",,,,,,,,,,,Articles,https://arxiupmaragall.catalunyaeuropa.net/files/original/30/686/19890509_LV.pdf,,"09.01. Activitat de representació (com a Alcalde)",1,0
"La Europa de las ciudades","Maragall, Pasqual, 1941-",,1990-02-15,Article,Textual,Castellà,Europa,,"El País",,,,,,,1074,,,,,,,,,,,,,,,,,,,,,,,,,,,,,,,,,,,,,,,,,,,,,,,,,,,,,,,,,,,,,,,,,,,,,,,,,,,,,,,,,,,,,,Document,,,,,,,,,,,,,,Articles,https://arxiupmaragall.catalunyaeuropa.net/files/original/30/807/0000001535.pdf,,"09.01. Activitat de representació (com a Alcalde)",1,0
"Barcelona y Gorbachev","Maragall, Pasqual, 1941-",,1990-11-11,Article,Textual,Castellà,"Gorbacov, Mikhail S.",,"La Vanguardia",,,,,,,1149,,,,,,,,,,,,,,,,,,,,,,,,,,,,,,,,,,,,,,,,,,,,,,,,,,,,,,,,,,,,,,,,,,,,,,,,,,,,,,,,,,,,,,Document,,,"Alcalde de Barcelona",,,,,,,,,,,Articles,https://arxiupmaragall.catalunyaeuropa.net/files/original/30/687/19901111_LV.pdf,,"09.01. Activitat de representació (com a Alcalde)",1,0
"Vaclav Havel en Barcelona","Maragall, Pasqual, 1941-",,1990-12-12,Article,Textual,Castellà,"Havel, Václav",,"La Vanguardia",,,,,,,1150,,,,,,,,,,,,,,,,,,,,,,,,,,,,,,,,,,,,,,,,,,,,,,,,,,,,,,,,,,,,,,,,,,,,,,,,,,,,,,,,,,,,,,Document,,,"Alcalde de Barcelona",,,,,,,,,,,Articles,"https://arxiupmaragall.catalunyaeuropa.net/files/original/30/688/19901212_LV.pdf,https://arxiupmaragall.catalunyaeuropa.net/files/original/30/688/0000001314.pdf",,"09.01. Activitat de representació (com a Alcalde)",1,0
"Vivienda asequible","Maragall, Pasqual, 1941-",,1991-05-10,Article,Textual,Castellà,Habitatge,,"La Vanguardia",,,,,,,1151,,,,,,,,,,,,,,,,,,,,,,,,,,,,,,,,,,,,,,,,,,,,,,,,,,,,,,,,,,,,,,,,,,,,,,,,,,,,,,,,,,,,,,Document,,,"Alcalde de Barcelona",,,,,,,,,,,Articles,https://arxiupmaragall.catalunyaeuropa.net/files/original/30/689/19910510_LV.pdf,,"09.01. Activitat de representació (com a Alcalde)",1,0
"Ilusión por Barcelona","Maragall, Pasqual, 1941-",,1991-05-23,Article,Textual,Castellà,Barcelona,,"La Vanguardia",,,,,,,1152,,,,,,,,,,,,,,,,,,,,,,,,,,,,,,,,,,,,,,,,,,,,,,,,,,,,,,,,,,,,,,,,,,,,,,,,,,,,,,,,,,,,,,Document,,,"Alcalde de Barcelona",,,,,,,,,,,Articles,https://arxiupmaragall.catalunyaeuropa.net/files/original/30/690/19910523_LV.pdf,,"09.01. Activitat de representació (com a Alcalde)",1,0
"Barcelona, una ciutat feta pels barcelonins","Maragall, Pasqual, 1941-",,1991-05-25,Article,Textual,Català,Barcelona,,"Diari de Barcelona",,,,"Aquest document és còpia digital de la còpia en paper custodiada a l'Arxiu Nacional de Catalunya.",,,,,,,,,,,,,,,,,,,,,,,,,,,,,,,,,,,,,,,,,,,,,,,,,,,,,,,,,,,,,,,,,,,,,,,,,,,,,,,,,,,,,,,,,Document,"UI 538",,,,,,,,,,,,,Articles,https://arxiupmaragall.catalunyaeuropa.net/files/original/30/2802/19910525_DiarideBarcelona_BarcelonaCiutatFetaBarcelonins_PM.pdf,,"09.01. Activitat de representació (com a Alcalde)",1,0
"Barcelona con Gorbachev","Maragall, Pasqual, 1941-",,1991-08-22,Article,Textual,Castellà,"Gorbacov, Mikhail S.",,"La Vanguardia",,,,,,,1153,,,,,,,,,,,,,,,,,,,,,,,,,,,,,,,,,,,,,,,,,,,,,,,,,,,,,,,,,,,,,,,,,,,,,,,,,,,,,,,,,,,,,,Document,,,"Alcalde de Barcelona",,,,,,,,,,,Articles,https://arxiupmaragall.catalunyaeuropa.net/files/original/30/691/19910822_LV.pdf,,"09.01. Activitat de representació (com a Alcalde)",1,0
