﻿"Dublin Core:Title","Dublin Core:Creator","Dublin Core:Contributor","Dublin Core:Date","Dublin Core:Type","Dublin Core:Format","Dublin Core:Language","Dublin Core:Subject","Dublin Core:Description","Dublin Core:Source","Dublin Core:Abstract","Dublin Core:Spatial Coverage","Dublin Core:Publisher","Dublin Core:Provenance","Dublin Core:Rights","Dublin Core:Relation","Dublin Core:Identifier","Dublin Core:Coverage","Dublin Core:Alternative Title","Dublin Core:Table Of Contents","Dublin Core:Date Available","Dublin Core:Date Created","Dublin Core:Date Accepted","Dublin Core:Date Copyrighted","Dublin Core:Date Submitted","Dublin Core:Date Issued","Dublin Core:Date Modified","Dublin Core:Date Valid","Dublin Core:Access Rights","Dublin Core:License","Dublin Core:Conforms To","Dublin Core:Has Format","Dublin Core:Has Part","Dublin Core:Has Version","Dublin Core:Is Format Of","Dublin Core:Is Part Of","Dublin Core:Is Referenced By","Dublin Core:Is Replaced By","Dublin Core:Is Required By","Dublin Core:Is Version Of","Dublin Core:References","Dublin Core:Replaces","Dublin Core:Requires","Dublin Core:Extent","Dublin Core:Medium","Dublin Core:Bibliographic Citation","Dublin Core:Temporal Coverage","Dublin Core:Accrual Method","Dublin Core:Accrual Periodicity","Dublin Core:Accrual Policy","Dublin Core:Audience","Dublin Core:Audience Education Level","Dublin Core:Mediator","Dublin Core:Instructional Method","Dublin Core:Rights Holder","Item Type Metadata:Text","Item Type Metadata:Interviewer","Item Type Metadata:Interviewee","Item Type Metadata:Location","Item Type Metadata:Transcription","Item Type Metadata:URL local","Item Type Metadata:Format original","Item Type Metadata:Dimensions físiques","Item Type Metadata:Duration","Item Type Metadata:Compression","Item Type Metadata:Producer","Item Type Metadata:Director","Item Type Metadata:Bit Rate/Frequency","Item Type Metadata:Time Summary","Item Type Metadata:Email Body","Item Type Metadata:Subject Line","Item Type Metadata:From","Item Type Metadata:To","Item Type Metadata:CC","Item Type Metadata:BCC","Item Type Metadata:Number of Attachments","Item Type Metadata:Standards","Item Type Metadata:Objectives","Item Type Metadata:Materials","Item Type Metadata:Lesson Plan Text","Item Type Metadata:URL","Item Type Metadata:Event Type","Item Type Metadata:Participants","Item Type Metadata:Birth Date","Item Type Metadata:Birthplace","Item Type Metadata:Death Date","Item Type Metadata:Occupation","Item Type Metadata:Biographical Text","Item Type Metadata:Bibliography","Item Type Metadata:Edition Statement","Item Type Metadata:Publication Statement","Item Type Metadata:Note statement","Item Type Metadata:Profile description : Creation","Item Type Metadata:Profile description : Descriptive Rules","Item Type Metadata:Profile description : Language Usage","Item Type Metadata:Revision Description : Change","Item Type Metadata:Revision Description : List","Item Type Metadata:Front matter : Title page","Item Type Metadata:Front matter : Division","Item Type Metadata:Destinatari","Item Type Metadata:Número de caixa","Item Type Metadata:Localització de la caixa","EAD Archive:Level","EAD Archive:Arrangement","EAD Archive:Descriptive Identification : Heading","EAD Archive:Descriptive Identification : Note","EAD Archive:Appraisal Information","EAD Archive:Biography or History","EAD Archive:Index","EAD Archive:Note","EAD Archive:Other Descriptive Data","EAD Archive:Processing Information","EAD Archive:Scope and Content","EAD Archive:Heading","EAD Archive:Table Head","PDF Text:Text",tags,file,itemType,collection,public,featured
"Discurs electoral final de la Campanya Eleccions Municipals 1987","Maragall, Pasqual, 1941-",,1987-06-08,Discurs,Textual,Català,Eleccions,,,,"Parc de la Ciutadella",,"Aquest document forma part del fons municipal de l’Ajuntament de Barcelona (productor de la documentació) i és còpia digital de l’original custodiat a l’Arxiu Municipal Contemporani de Barcelona.",,,4006,,,,,,,,,,,,,,,,,,,,,,,,,,,,,,,,,,,,,,,,,,,,,,,,,,,,,,,,,,,,,,,,,,,,,,,,,,,,,,,,,,,,,,Document,,,,,,,,,,,,,,"Discursos i conferències",https://arxiupmaragall.catalunyaeuropa.net/files/original/30/1100/19870608d_0022.pdf,,"09.01. Activitat de representació (com a Alcalde)",1,0
"Paraules de victòria en les Eleccions Municipals 1987","Maragall, Pasqual, 1941-",,1987-06-10,Discurs,Textual,Català,Socialisme,,,,"Hotel Manila, Barcelona",,"Aquest document forma part del fons municipal de l’Ajuntament de Barcelona (productor de la documentació) i és còpia digital de l’original custodiat a l’Arxiu Municipal Contemporani de Barcelona.",,,4007,,,,,,,,,,,,,,,,,,,,,,,,,,,,,,,,,,,,,,,,,,,,,,,,,,,,,,,,,,,,,,,,,,,,,,,,,,,,,,,,,,,,,,Document,,,,,,,,,,,,,,"Discursos i conferències",https://arxiupmaragall.catalunyaeuropa.net/files/original/30/1101/19870610d_00223.pdf,,"09.01. Activitat de representació (com a Alcalde)",1,0
"Notes Senyor alcalde per diferents discursos","Maragall, Pasqual, 1941-",,1987-06-29,Discurs,Textual,Català,Política,"Notes manuscrites de PM revisant discursos i intervencions propis anteriors.",,,,,"Aquest document forma part del fons municipal de l’Ajuntament de Barcelona (productor de la documentació) i és còpia digital de l’original custodiat a l’Arxiu Municipal Contemporani de Barcelona.",,,4008,,,,,,,,,,,,,,,,,,,,,,,,,,,,,,,,,,,,,,,,,,,,,,,,,,,,,,,,,,,,,,,,,,,,,,,,,,,,,,,,,,,,,,Document,,,,,,,,,,,,,,"Discursos i conferències",https://arxiupmaragall.catalunyaeuropa.net/files/original/30/1102/19870629d_00226.pdf,,"09.01. Activitat de representació (com a Alcalde)",1,0
"Ordre de la Sessió Plenària Constitutiva de la Corporació","Maragall, Pasqual, 1941-",,1987-06-30,Discurs,Textual,Català,Govern,,,,"Saló de Cent",,"Aquest document forma part del fons municipal de l’Ajuntament de Barcelona (productor de la documentació) i és còpia digital de l’original custodiat a l’Arxiu Municipal Contemporani de Barcelona.",,,4009,,,,,,,,,,,,,,,,,,,,,,,,,,,,,,,,,,,,,,,,,,,,,,,,,,,,,,,,,,,,,,,,,,,,,,,,,,,,,,,,,,,,,,Document,,,,,,,,,,,,,,"Discursos i conferències",https://arxiupmaragall.catalunyaeuropa.net/files/original/30/1103/19870630d_00225.pdf,,"09.01. Activitat de representació (com a Alcalde)",1,0
"Paraules de Pasqual Maragall al Sopar d'Alcaldes del PSC celebrat a l'àrea de Bellaterra (B-30)","Maragall, Pasqual, 1941-",,1988-03-03,Discurs,Textual,Català,Municipis,,,,Bellaterra,,"Aquest document és còpia digital de l'original custodiat a l'Arxiu Nacional de Catalunya.",,,,,,,,,,,,,,,,,,,,,,,,,,,,,,,,,,,,,,,,,,,,,,,,,,,,,,,,,,,,,,,,,,,,,,,,,,,,,,,,,,,,,,,,,Document,"UI 175",,,,,,,,,,,,,"Discursos i conferències",https://arxiupmaragall.catalunyaeuropa.net/files/original/23/2789/19880303_SoparAlcaldes_PM.pdf,,"04.02. Activitat política",1,0
"Un discurs esperançat sobre el futur de Catalunya","Maragall, Pasqual, 1941-",,1988-04-12,Discurs,Textual,Català,Eleccions,"Discurs de Pasqual Maragall en un acte de campanya del PSC per les eleccions autonòmiques de 1988, amb Raimon Obiols de cap de llista i candidat a la presidència de la Generalitat. Conté diversos fulls amb notes manuscrites de PM.",,,,,"Aquest document és còpia digital de l'original custodiat a l'Arxiu Nacional de Catalunya.",,,,,,,,,,,,,,,,,,,,,,,,,,,,,,,,,,,,,,,,,,,,,,,,,,,,,,,,,,,,,,,,,,,,,,,,,,,,,,,,,,,,,,,,,Document,"UI 175",,,,,,,,,,,,,"Discursos i conferències",https://arxiupmaragall.catalunyaeuropa.net/files/original/23/2791/19880412_FuturEsperancat_Campanya_PM.pdf,,"04.02. Activitat política",1,0
"Ilusión por Barcelona","Maragall, Pasqual, 1941-",,1991-05-23,Article,Textual,Castellà,Barcelona,,"La Vanguardia",,,,,,,1152,,,,,,,,,,,,,,,,,,,,,,,,,,,,,,,,,,,,,,,,,,,,,,,,,,,,,,,,,,,,,,,,,,,,,,,,,,,,,,,,,,,,,,Document,,,"Alcalde de Barcelona",,,,,,,,,,,Articles,https://arxiupmaragall.catalunyaeuropa.net/files/original/30/690/19910523_LV.pdf,,"09.01. Activitat de representació (com a Alcalde)",1,0
"Acte públic a Prada. Míting en les eleccions generals de França 1993","Maragall, Pasqual, 1941-",,1993-03-13,Discurs,Textual,Francès,Política,,,"Sistema europeu de ciutat es caracteritza per la seva cohesió global i per la diversitat interna. Les ciutats són competitives i complementàries. Els polítics poden oferir cooperació entre institucions, idees estimulants per a nous projectes, sinceritat en l'exposició dels problemes i sensibilitat per mantenir conquestes socials.","Cinema Lido, Prada, França",,"Aquest document forma part del fons municipal de l’Ajuntament de Barcelona (productor de la documentació) i és còpia digital de l’original custodiat a l’Arxiu Municipal Contemporani de Barcelona.",,,4218,,,,,,,,,,,,,,,,,,,,,,,,,,,,,,,,,,,,,,,,,,,,,,,,,,,,,,,,,,,,,,,,,,,,,,,,,,,,,,,,,,,,,,Document,,,,,,,,,,,,,,"Discursos i conferències",https://arxiupmaragall.catalunyaeuropa.net/files/original/30/1312/19930313d_00538.pdf,,"09.01. Activitat de representació (com a Alcalde)",1,0
"Barcelona y las elecciones","Maragall, Pasqual, 1941-",,1993-06-01,Article,Textual,Castellà,"Pujol, Jordi, 1930-",,"La Vanguardia",,,,,,,1164,,,,,,,,,,,,,,,,,,,,,,,,,,,,,,,,,,,,,,,,,,,,,,,,,,,,,,,,,,,,,,,,,,,,,,,,,,,,,,,,,,,,,,Document,,,"Alcalde de Barcelona",,,,,,,,,,,Articles,https://arxiupmaragall.catalunyaeuropa.net/files/original/30/702/19930601_LV.pdf,,"09.01. Activitat de representació (com a Alcalde)",1,0
"El cambio del cambio en Cataluña","Maragall, Pasqual, 1941-",,1993-06-13,Article,Textual,Castellà,Catalunya,,"La Vanguardia",,,,,,,1165,,,,,,,,,,,,,,,,,,,,,,,,,,,,,,,,,,,,,,,,,,,,,,,,,,,,,,,,,,,,,,,,,,,,,,,,,,,,,,,,,,,,,,Document,,,"Alcalde de Barcelona",,,,,,,,,,,Articles,https://arxiupmaragall.catalunyaeuropa.net/files/original/30/703/19930613_LV.pdf,,"09.01. Activitat de representació (com a Alcalde)",1,0
