﻿"Dublin Core:Title","Dublin Core:Creator","Dublin Core:Contributor","Dublin Core:Date","Dublin Core:Type","Dublin Core:Format","Dublin Core:Language","Dublin Core:Subject","Dublin Core:Description","Dublin Core:Source","Dublin Core:Abstract","Dublin Core:Spatial Coverage","Dublin Core:Publisher","Dublin Core:Provenance","Dublin Core:Rights","Dublin Core:Relation","Dublin Core:Identifier","Dublin Core:Coverage","Dublin Core:Alternative Title","Dublin Core:Table Of Contents","Dublin Core:Date Available","Dublin Core:Date Created","Dublin Core:Date Accepted","Dublin Core:Date Copyrighted","Dublin Core:Date Submitted","Dublin Core:Date Issued","Dublin Core:Date Modified","Dublin Core:Date Valid","Dublin Core:Access Rights","Dublin Core:License","Dublin Core:Conforms To","Dublin Core:Has Format","Dublin Core:Has Part","Dublin Core:Has Version","Dublin Core:Is Format Of","Dublin Core:Is Part Of","Dublin Core:Is Referenced By","Dublin Core:Is Replaced By","Dublin Core:Is Required By","Dublin Core:Is Version Of","Dublin Core:References","Dublin Core:Replaces","Dublin Core:Requires","Dublin Core:Extent","Dublin Core:Medium","Dublin Core:Bibliographic Citation","Dublin Core:Temporal Coverage","Dublin Core:Accrual Method","Dublin Core:Accrual Periodicity","Dublin Core:Accrual Policy","Dublin Core:Audience","Dublin Core:Audience Education Level","Dublin Core:Mediator","Dublin Core:Instructional Method","Dublin Core:Rights Holder","Item Type Metadata:Text","Item Type Metadata:Interviewer","Item Type Metadata:Interviewee","Item Type Metadata:Location","Item Type Metadata:Transcription","Item Type Metadata:URL local","Item Type Metadata:Format original","Item Type Metadata:Dimensions físiques","Item Type Metadata:Duration","Item Type Metadata:Compression","Item Type Metadata:Producer","Item Type Metadata:Director","Item Type Metadata:Bit Rate/Frequency","Item Type Metadata:Time Summary","Item Type Metadata:Email Body","Item Type Metadata:Subject Line","Item Type Metadata:From","Item Type Metadata:To","Item Type Metadata:CC","Item Type Metadata:BCC","Item Type Metadata:Number of Attachments","Item Type Metadata:Standards","Item Type Metadata:Objectives","Item Type Metadata:Materials","Item Type Metadata:Lesson Plan Text","Item Type Metadata:URL","Item Type Metadata:Event Type","Item Type Metadata:Participants","Item Type Metadata:Birth Date","Item Type Metadata:Birthplace","Item Type Metadata:Death Date","Item Type Metadata:Occupation","Item Type Metadata:Biographical Text","Item Type Metadata:Bibliography","Item Type Metadata:Edition Statement","Item Type Metadata:Publication Statement","Item Type Metadata:Note statement","Item Type Metadata:Profile description : Creation","Item Type Metadata:Profile description : Descriptive Rules","Item Type Metadata:Profile description : Language Usage","Item Type Metadata:Revision Description : Change","Item Type Metadata:Revision Description : List","Item Type Metadata:Front matter : Title page","Item Type Metadata:Front matter : Division","Item Type Metadata:Destinatari","Item Type Metadata:Número de caixa","Item Type Metadata:Localització de la caixa","EAD Archive:Level","EAD Archive:Arrangement","EAD Archive:Descriptive Identification : Heading","EAD Archive:Descriptive Identification : Note","EAD Archive:Appraisal Information","EAD Archive:Biography or History","EAD Archive:Index","EAD Archive:Note","EAD Archive:Other Descriptive Data","EAD Archive:Processing Information","EAD Archive:Scope and Content","EAD Archive:Heading","EAD Archive:Table Head","PDF Text:Text",tags,file,itemType,collection,public,featured
"Carta de Pasqual Maragall a Pujol i a González","Maragall, Pasqual, 1941-",,1997-10-01,Article,Textual,Català,Territoris,"27 p.","Barcelona Metròpolis Mediterrània","Article publicat al número 37 Setembre-Octubre de 1997 de BMM. En el moment de deixar l'alcaldia de Barcelona, Pasqual Maragall va enviar aquesta carta als presidents català i espanyol.",,,,,,,,,,,,,,,,,,,,,,,,,,,,,"Té una versió prèvia a #1454 ""Carta de l'Excm. Sr. Alcalde Pasqual Maragall al President del Govern Espanyol i al President de la Generalitat"".",,,,,,,,,,,,,,,,,,,,,,,,,,,,,,,,,,,,,,,,,,,,,,,,,,,,,,,,,,,,,,,Document,,,,,,,,,,,,,,Articles,https://arxiupmaragall.catalunyaeuropa.net/files/original/30/952/Carta_a_Pujol_Gonzalez_BMM_37_1997.pdf,,"09.01. Activitat de representació (com a Alcalde)",1,0
"Galicia. DESDE ROMA","Maragall, Pasqual, 1941-",,1997-11-14,Article,Textual,Castellà,Federalisme,,"La Vanguardia",,,,,,,1188,,,,,,,,,,,,,,,,,,,,,,,,,,,,,,,,,,,,,,,,,,,,,,,,,,,,,,,,,,,,,,,,,,,,,,,,,,,,,,,,,,,,,,Document,,,"Activitat professional",,,,,,,,,,,Articles,https://arxiupmaragall.catalunyaeuropa.net/files/original/8/726/19971114_LV.pdf,,"02. Activitat professional",1,0
"The politics of Spain today. Strange bedfellows and asymmetrical federalism.","Maragall, Pasqual, 1941-",,1998-02-11,Conferència,Textual,Anglès,Espanya,,,"Notes per la conferència pronunciada al King Juan Carlos Center Auditorium, com a Distinguished Visiting Fellow per la King Juan Carlos I of Spain Center of New York University, el primer semestre de 1998.","King Juan Carlos I Auditorium, NYU",,,,,,,,,,,,,,,,,,,,,,,,,,,,,,,,,,,,,,,,,,,,,,,,,,,,,,,,,,,,,,,,,,,,,,,,,,,,,,,,,,,,,,,,,,,Document,,,,,,,,,,,,,,"Discursos i conferències",https://arxiupmaragall.catalunyaeuropa.net/files/original/17/1742/19980211_PoliticsSpainToday_StrangeBedfellows_KJCNYU_PM.pdf,,"01.01.02. Activitat acadèmica",1,0
"Preferimos mejorar. DESDE ROMA","Maragall, Pasqual, 1941-",,1998-02-28,Article,Textual,Castellà,Catalunya,,"La Vanguardia",,,,,,,1202,,,,,,,,,,,,,,,,,,,,,,,,,,,,,,,,,,,,,,,,,,,,,,,,,,,,,,,,,,,,,,,,,,,,,,,,,,,,,,,,,,,,,,Document,,,"Activitat professional",,,,,,,,,,,Articles,https://arxiupmaragall.catalunyaeuropa.net/files/original/8/740/19980228_LV.pdf,,"02. Activitat professional",1,0
"El futur del catalanisme","Maragall, Pasqual, 1941-",,1998-04-01,Article,Textual,Català,Catalanisme,,"Marc de Referències",,,,"Aquest document és còpia digital de la còpia en paper custodiada a l'Arxiu Nacional de Catalunya.",,,,,,,,,,,,,,,,,,,,,,,,,,,,,,,,,,,,,,,,,,,,,,,,,,,,,,,,,,,,,,,,,,,,,,,,,,,,,,,,,,,,,,,,,Document,"UI 536",,,,,,,,,,,,,Articles,https://arxiupmaragall.catalunyaeuropa.net/files/original/23/2803/19980401_MarcDeReferencies_FuturCatalanisme_PM.pdf,,"04.02. Activitat política",1,0
"Un mundo de ciudades: la mejor respuesta a la globalización","Maragall, Pasqual, 1941-",,1998-04-03,Conferència,Textual,Castellà,Ciutats,,,"Guió per la intervenció al seminari ""De urbe et orbe: the opportunities and challenges of globalization for cities in Spain, Latin America and the US)"", amb alcaldes i urbanistes, organitzat per the Spanish Institute, el King Juan Carlos Center i l'ICAS.","King Juan Carlos Center, NYU",,,,,,,,,,,,,,,,,,,,,,,,,,,,,,,,,,,,,,,,,,,,,,,,,,,,,,,,,,,,,,,,,,,,,,,,,,,,,,,,,,,,,,,,,,,Document,,,,,,,,,,,,,,"Discursos i conferències",https://arxiupmaragall.catalunyaeuropa.net/files/original/17/1746/0000001421.pdf,,"01.01.02. Activitat acadèmica",1,0
"Pròleg del llibre ""Catalunya , de la identitat a la independència"" de Xavier Rubert de Ventós","Maragall, Pasqual, 1941-",,1999,Pròleg,Textual,Català,"Identitat col·lectiva",,,,,Empúries,,,,,,,,,,,,,,,,,,,,,,,,,,,,,,,,,,,,,,,,,,,,,,,,,,,,,,,,,,,,,,,,,,,,,,,,,,,,,,,,,,,,,,,,,,Document,,,,,,,,,,,,,,Escrits,https://arxiupmaragall.catalunyaeuropa.net/files/original/9/1761/1999_proleg_delaidentitatalaindependencia_XRdV_PM.pdf,,"03. Activitat creativa",1,0
"Prólogo del libro ""Cataluña, de la identidad a la independencia"" de Xavier Rubert de Ventós","Maragall, Pasqual, 1941-",,1999,Pròleg,Textual,Castellà,"Identitat col·lectiva",,,,,Anagrama,,,,,,,,,,,,,,,,,,,,,,,,,,,,,,,,,,,,,,,,,,,,,,,,,,,,,,,,,,,,,,,,,,,,,,,,,,,,,,,,,,,,,,,,,,Document,,,,,,,,,,,,,,Escrits,https://arxiupmaragall.catalunyaeuropa.net/files/original/9/1762/1999_prologo_delaidentidadalaindependencia_XRdV_PM.pdf,,"03. Activitat creativa",1,0
"Acte de presentació de candidatures del PSC. Intervenció de Pasqual Maragall.","Maragall, Pasqual, 1941-",,2000-02-06,Discurs,Textual,Català,"Partit dels Socialistes de Catalunya (PSC-PSOE)","Document amb la proposta d'intervenció, amb notes manuscrites de Pasqual Maragall.",,,"Teatre Principal",,"Aquest document és còpia digital de l'original custodiat a l'Arxiu Nacional de Catalunya.",,,,,,,,,,,,,,,,,,,,,,,,,,,,,,,,,,,,,,,,,,,,,,,,,,,,,,,,,,,,,,,,,,,,,,,,,,,,,,,,,,,,,,,,,Document,"UI 23",,,,,,,,,,,,,"Discursos i conferències",https://arxiupmaragall.catalunyaeuropa.net/files/original/23/2771/20000206_PresentacioCandidaturesPSC_PM.pdf,,"04.02. Activitat política",1,0
"Euskadi mañana","Maragall, Pasqual, 1941-",,2000-02-27,Article,Textual,Castellà,"Buesa Blanco, Fernando",,"La Vanguardia",,,,,,,1215,,,,,,,,,,,,,,,,,,,,,,,,,,,,,,,,,,,,,,,,,,,,,,,,,,,,,,,,,,,,,,,,,,,,,,,,,,,,,,,,,,,,,,Document,,,"Activitat política",,,,,,,,,,,Articles,https://arxiupmaragall.catalunyaeuropa.net/files/original/23/752/20000227_LV.pdf,,"04.02. Activitat política",1,0
