﻿"Dublin Core:Title","Dublin Core:Creator","Dublin Core:Contributor","Dublin Core:Date","Dublin Core:Type","Dublin Core:Format","Dublin Core:Language","Dublin Core:Subject","Dublin Core:Description","Dublin Core:Source","Dublin Core:Abstract","Dublin Core:Spatial Coverage","Dublin Core:Publisher","Dublin Core:Provenance","Dublin Core:Rights","Dublin Core:Relation","Dublin Core:Identifier","Dublin Core:Coverage","Dublin Core:Alternative Title","Dublin Core:Table Of Contents","Dublin Core:Date Available","Dublin Core:Date Created","Dublin Core:Date Accepted","Dublin Core:Date Copyrighted","Dublin Core:Date Submitted","Dublin Core:Date Issued","Dublin Core:Date Modified","Dublin Core:Date Valid","Dublin Core:Access Rights","Dublin Core:License","Dublin Core:Conforms To","Dublin Core:Has Format","Dublin Core:Has Part","Dublin Core:Has Version","Dublin Core:Is Format Of","Dublin Core:Is Part Of","Dublin Core:Is Referenced By","Dublin Core:Is Replaced By","Dublin Core:Is Required By","Dublin Core:Is Version Of","Dublin Core:References","Dublin Core:Replaces","Dublin Core:Requires","Dublin Core:Extent","Dublin Core:Medium","Dublin Core:Bibliographic Citation","Dublin Core:Temporal Coverage","Dublin Core:Accrual Method","Dublin Core:Accrual Periodicity","Dublin Core:Accrual Policy","Dublin Core:Audience","Dublin Core:Audience Education Level","Dublin Core:Mediator","Dublin Core:Instructional Method","Dublin Core:Rights Holder","Item Type Metadata:Text","Item Type Metadata:Interviewer","Item Type Metadata:Interviewee","Item Type Metadata:Location","Item Type Metadata:Transcription","Item Type Metadata:URL local","Item Type Metadata:Format original","Item Type Metadata:Dimensions físiques","Item Type Metadata:Duration","Item Type Metadata:Compression","Item Type Metadata:Producer","Item Type Metadata:Director","Item Type Metadata:Bit Rate/Frequency","Item Type Metadata:Time Summary","Item Type Metadata:Email Body","Item Type Metadata:Subject Line","Item Type Metadata:From","Item Type Metadata:To","Item Type Metadata:CC","Item Type Metadata:BCC","Item Type Metadata:Number of Attachments","Item Type Metadata:Standards","Item Type Metadata:Objectives","Item Type Metadata:Materials","Item Type Metadata:Lesson Plan Text","Item Type Metadata:URL","Item Type Metadata:Event Type","Item Type Metadata:Participants","Item Type Metadata:Birth Date","Item Type Metadata:Birthplace","Item Type Metadata:Death Date","Item Type Metadata:Occupation","Item Type Metadata:Biographical Text","Item Type Metadata:Bibliography","Item Type Metadata:Edition Statement","Item Type Metadata:Publication Statement","Item Type Metadata:Note statement","Item Type Metadata:Profile description : Creation","Item Type Metadata:Profile description : Descriptive Rules","Item Type Metadata:Profile description : Language Usage","Item Type Metadata:Revision Description : Change","Item Type Metadata:Revision Description : List","Item Type Metadata:Front matter : Title page","Item Type Metadata:Front matter : Division","Item Type Metadata:Destinatari","Item Type Metadata:Número de caixa","Item Type Metadata:Localització de la caixa","EAD Archive:Level","EAD Archive:Arrangement","EAD Archive:Descriptive Identification : Heading","EAD Archive:Descriptive Identification : Note","EAD Archive:Appraisal Information","EAD Archive:Biography or History","EAD Archive:Index","EAD Archive:Note","EAD Archive:Other Descriptive Data","EAD Archive:Processing Information","EAD Archive:Scope and Content","EAD Archive:Heading","EAD Archive:Table Head","PDF Text:Text",tags,file,itemType,collection,public,featured
"Chincha Choma (Alejandro García Durán)","Maragall, Pasqual, 1941-",,2000-06-05,Article,Textual,Castellà,"García Durán, Alejandro",,"El País",,,,,,,1095,,,,,,,,,,,,,,,,,,,,,,,,,,,,,,,,,,,,,,,,,,,,,,,,,,,,,,,,,,,,,,,,,,,,,,,,,,,,,,,,,,,,,,Document,,,,,,,,,,,,,,Articles,https://arxiupmaragall.catalunyaeuropa.net/files/original/23/851/0000001552.pdf,,"04.02. Activitat política",1,0
"Faustino y los demás","Maragall, Pasqual, 1941-",,2000-01-17,Article,Textual,Castellà,Necrologies,,"El País",,,,,,,1094,,,,,,,,,,,,,,,,,,,,,,,,,,,,,,,,,,,,,,,,,,,,,,,,,,,,,,,,,,,,,,,,,,,,,,,,,,,,,,,,,,,,,,Document,,,,,,,,,,,,,,Articles,https://arxiupmaragall.catalunyaeuropa.net/files/original/23/850/0000001551.pdf,,"04.02. Activitat política",1,0
"Más democracia para Europa","González Márquez, Felipe, 1942-",,1998-05-27,Article,Textual,Castellà,Europa,,"El País",,,,,,,1093,,,,,,,,,,,,,,,,,,,,,,,,,,,,,,,,,,,,,,,,,,,,,,,,,,,,,,,,,,,,,,,,,,,,,,,,,,,,,,,,,,,,,,Document,,,,,,,,,,,,,,Articles,https://arxiupmaragall.catalunyaeuropa.net/files/original/23/849/0000001550.pdf,,"04.02. Activitat política",1,0
"Un punto de vista común","Maragall, Pasqual, 1941-",,1997-08-28,Article,Textual,Castellà,Territoris,,"El País",,,,,,,1092,,,,,,,,,,,,,,,,,,,,,,,,,,,,,,,,,,,,,,,,,,,,,,,,,,,,,,,,,,,,,,,,,,,,,,,,,,,,,,,,,,,,,,Document,,,,,,,,,,,,,,Articles,https://arxiupmaragall.catalunyaeuropa.net/files/original/30/825/0000001549.pdf,,"09.01. Activitat de representació (com a Alcalde)",1,0
"Desde Cataluña, federalismo","Maragall, Pasqual, 1941-",,1997-07-04,Article,Textual,Castellà,Territoris,,"El País",,,,,,,1091,,,,,,,,,,,,,,,,,,,,,,,,,,,,,,,,,,,,,,,,,,,,,,,,,,,,,,,,,,,,,,,,,,,,,,,,,,,,,,,,,,,,,,Document,,,,,,,,,,,,,,Articles,https://arxiupmaragall.catalunyaeuropa.net/files/original/30/824/0000001458.pdf,,"09.01. Activitat de representació (com a Alcalde)",1,0
"La cumbre de los pequeños en Amsterdam","Maragall, Pasqual, 1941-",,1997-02-27,Article,Textual,Castellà,Europa,,"El País",,,,,,,1090,,,,,,,,,,,,,,,,,,,,,,,,,,,,,,,,,,,,,,,,,,,,,,,,,,,,,,,,,,,,,,,,,,,,,,,,,,,,,,,,,,,,,,Document,,,,,,,,,,,,,,Articles,https://arxiupmaragall.catalunyaeuropa.net/files/original/18/823/0000001548.pdf,,"10. Comitè de les Regions (CdR)",1,0
"Ciudad del hombre, metrópoli ciudadana","Maragall, Pasqual, 1941-",,1996-07-07,Article,Textual,Castellà,Barcelona,,"El País",,,,"Aquest document és còpia digital de la còpia en paper custodiada a l'Arxiu Nacional de Catalunya.",,,,,,,,,,,,,,,,,,,,,,,,,,,,,,,,,,,,,,,,,,,,,,,,,,,,,,,,,,,,,,,,,,,,,,,,,,,,,,,,,,,,,,,,,Document,"UI 538",,,,,,,,,,,,,Articles,https://arxiupmaragall.catalunyaeuropa.net/files/original/30/2799/19960707_ElPais_CiudadHombreMetropoliCiudadana_PM.pdf,,"09.01. Activitat de representació (com a Alcalde)",1,0
"Per un llenguatge europeu","Maragall, Pasqual, 1941-",,1996-01-25,Article,Textual,Català,Balanç,"Resum publicat al suplement Quadern, de la conferència anual sobre l'estat de la ciutat i balanç de l'any 1995 de l'Alcalde de Barcelona.","El País",,,,"Aquest document és còpia digital de la còpia en paper custodiada a l'Arxiu Nacional de Catalunya.",,,,,,,,,,,,,,,,,,,,,,,,,,,,,,,,,,,,,,,,,,,,,,,,,,,,,,,,,,,,,,,,,,,,,,,,,,,,,,,,,,,,,,,,,Document,"UI 538",,,,,,,,,,,,,,https://arxiupmaragall.catalunyaeuropa.net/files/original/30/2798/19960125_ElPais_Quadern_PerUnLlenguatgeEuropeu_PM.pdf,,"09.01. Activitat de representació (com a Alcalde)",1,0
"Las epístolas sobre Europa de Maragall",,,1995/07/16,Article,Textual,Castellà,Alcaldes,"Article de la redacció del diari El País recollint l'enviament de Maragall a diverses personalitats europees, reflexionant sobre els reptes d'Europa i el seu futur.","El País",,,,"Aquest document forma part del fons municipal de l’Ajuntament de Barcelona (productor de la documentació) i és còpia digital de l’original custodiat a l’Arxiu Municipal Contemporani de Barcelona.",,,,,,,,,,,,,,,,,,,,,,,,,,,,,,,,,,,,,,,,,,,,,,,,,,,,,,,,,,,,,,,,,,,,,,,,,,,,,,,,,,,,,,,,,Document,,,,,,,,,,,,,,Articles,https://arxiupmaragall.catalunyaeuropa.net/files/original/12/2732/19950716_ElPais_CartesPM_Europa.pdf,,"05. Recursos d'informació",1,0
"De política de mínimos a política de calidad","Maragall, Pasqual, 1941-",,1995-06-04,Article,Textual,Castellà,"Acció política",,"El País",,,,,,,1089,,,,,,,,,,,,,,,,,,,,,,,,,,,,,,,,,,,,,,,,,,,,,,,,,,,,,,,,,,,,,,,,,,,,,,,,,,,,,,,,,,,,,,Document,,,,,,,,,,,,,,Articles,https://arxiupmaragall.catalunyaeuropa.net/files/original/30/822/0000001547.pdf,,"09.01. Activitat de representació (com a Alcalde)",1,0
