﻿"Dublin Core:Title","Dublin Core:Creator","Dublin Core:Contributor","Dublin Core:Date","Dublin Core:Type","Dublin Core:Format","Dublin Core:Language","Dublin Core:Subject","Dublin Core:Description","Dublin Core:Source","Dublin Core:Abstract","Dublin Core:Spatial Coverage","Dublin Core:Publisher","Dublin Core:Provenance","Dublin Core:Rights","Dublin Core:Relation","Dublin Core:Identifier","Dublin Core:Coverage","Dublin Core:Alternative Title","Dublin Core:Table Of Contents","Dublin Core:Date Available","Dublin Core:Date Created","Dublin Core:Date Accepted","Dublin Core:Date Copyrighted","Dublin Core:Date Submitted","Dublin Core:Date Issued","Dublin Core:Date Modified","Dublin Core:Date Valid","Dublin Core:Access Rights","Dublin Core:License","Dublin Core:Conforms To","Dublin Core:Has Format","Dublin Core:Has Part","Dublin Core:Has Version","Dublin Core:Is Format Of","Dublin Core:Is Part Of","Dublin Core:Is Referenced By","Dublin Core:Is Replaced By","Dublin Core:Is Required By","Dublin Core:Is Version Of","Dublin Core:References","Dublin Core:Replaces","Dublin Core:Requires","Dublin Core:Extent","Dublin Core:Medium","Dublin Core:Bibliographic Citation","Dublin Core:Temporal Coverage","Dublin Core:Accrual Method","Dublin Core:Accrual Periodicity","Dublin Core:Accrual Policy","Dublin Core:Audience","Dublin Core:Audience Education Level","Dublin Core:Mediator","Dublin Core:Instructional Method","Dublin Core:Rights Holder","Item Type Metadata:Text","Item Type Metadata:Interviewer","Item Type Metadata:Interviewee","Item Type Metadata:Location","Item Type Metadata:Transcription","Item Type Metadata:URL local","Item Type Metadata:Format original","Item Type Metadata:Dimensions físiques","Item Type Metadata:Duration","Item Type Metadata:Compression","Item Type Metadata:Producer","Item Type Metadata:Director","Item Type Metadata:Bit Rate/Frequency","Item Type Metadata:Time Summary","Item Type Metadata:Email Body","Item Type Metadata:Subject Line","Item Type Metadata:From","Item Type Metadata:To","Item Type Metadata:CC","Item Type Metadata:BCC","Item Type Metadata:Number of Attachments","Item Type Metadata:Standards","Item Type Metadata:Objectives","Item Type Metadata:Materials","Item Type Metadata:Lesson Plan Text","Item Type Metadata:URL","Item Type Metadata:Event Type","Item Type Metadata:Participants","Item Type Metadata:Birth Date","Item Type Metadata:Birthplace","Item Type Metadata:Death Date","Item Type Metadata:Occupation","Item Type Metadata:Biographical Text","Item Type Metadata:Bibliography","Item Type Metadata:Edition Statement","Item Type Metadata:Publication Statement","Item Type Metadata:Note statement","Item Type Metadata:Profile description : Creation","Item Type Metadata:Profile description : Descriptive Rules","Item Type Metadata:Profile description : Language Usage","Item Type Metadata:Revision Description : Change","Item Type Metadata:Revision Description : List","Item Type Metadata:Front matter : Title page","Item Type Metadata:Front matter : Division","Item Type Metadata:Destinatari","Item Type Metadata:Número de caixa","Item Type Metadata:Localització de la caixa","EAD Archive:Level","EAD Archive:Arrangement","EAD Archive:Descriptive Identification : Heading","EAD Archive:Descriptive Identification : Note","EAD Archive:Appraisal Information","EAD Archive:Biography or History","EAD Archive:Index","EAD Archive:Note","EAD Archive:Other Descriptive Data","EAD Archive:Processing Information","EAD Archive:Scope and Content","EAD Archive:Heading","EAD Archive:Table Head","PDF Text:Text",tags,file,itemType,collection,public,featured
"AENA 0-Aerolíneas 10","Maragall, Pasqual, 1941-",,2008-12-25,Article,Textual,Castellà,Infraestructures,,"El País",,,,,,,4447,,,,,,,,,,,,,,,,,,,,,,,,,,,,,,,,,,,,,,,,,,,,,,,,,,,,,,,,,,,,,,,,,,,,,,,,,,,,,,,,,,,,,,Document,,,,,,,,,,,,,,Articles,https://arxiupmaragall.catalunyaeuropa.net/files/original/21/889/0000000976.pdf,,"13. Expresident de la Generalitat de Catalunya",1,0
"Los Estados Unidos de Europa, reinventados","Maragall, Pasqual, 1941-",,2008-12-20,Article,Textual,Castellà,"Acció política",,"El País",,,,,,,4445,,,,,,,,,,,,,,,,,,,,,,,,,,,,,,,,,,,,,,,,,,,,,,,,,,,,,,,,,,,,,,,,,,,,,,,,,,,,,,,,,,,,,,Document,,,,,,,,,,,,,,Articles,https://arxiupmaragall.catalunyaeuropa.net/files/original/21/887/0000000975.pdf,,"13. Expresident de la Generalitat de Catalunya",1,0
"Barcelona, capital del Mediterráneo","Maragall, Pasqual, 1941-",,2008-11-25,Article,Textual,Castellà,Mediterrània,,"El País",,,,,,,4446,,,,,,,,,,,,,,,,,,,,,,,,,,,,,,,,,,,,,,,,,,,,,,,,,,,,,,,,,,,,,,,,,,,,,,,,,,,,,,,,,,,,,,Document,,,,,,,,,,,,,,Articles,https://arxiupmaragall.catalunyaeuropa.net/files/original/21/888/0000000973.pdf,,"13. Expresident de la Generalitat de Catalunya",1,0
"América / Europa","Maragall, Pasqual, 1941-",,2008-11-23,Article,Textual,Castellà,"Estats Units",,Público,,,,,,,1557,,,,,,,,,,,,,,,,,,,,,,,,,,,,,,,,,,,,,,,,,,,,,,,,,,,,,,,,,,,,,,,,,,,,,,,,,,,,,,,,,,,,,,Document,,,,,,,,,,,,,,Articles,https://arxiupmaragall.catalunyaeuropa.net/files/original/21/1715/0000000972.pdf,,"13. Expresident de la Generalitat de Catalunya",1,0
"Paraules del MH Pasqual Maragall al “The North Africa Business Development Forum” (NABDF)","Maragall, Pasqual, 1941-",,2008-11-13,Discurs,Textual,Castellà,Empreses,,,"Intervenció a la reunió del “The North Africa Business Development Forum” (NABDF).","La Casa La Llotja de Mar",,,,,,,,,,,,,,,,,,,,,,,,,,,,,,,,,,,,,,,,,,,,,,,,,,,,,,,,,,,,,,,,,,,,,,,,,,,,,,,,,,,,,,,,,,,Document,,,,,,,,,,,,,,"Discursos i conferències",https://arxiupmaragall.catalunyaeuropa.net/files/original/21/931/0000000970.pdf,,"13. Expresident de la Generalitat de Catalunya",1,0
"Europe / America","Maragall, Pasqual, 1941-",,2008-11-05,Discurs,Textual,Anglès,"Estats Units",,,"Discurs a la King Juan Carlos Center de la NYU.","King Juan Carlos Center (New York)",,,,,,,,,,,,,,,,,,,,,,,,,,,,,,,,,,,,,,,,,,,,,,,,,,,,,,,,,,,,,,,,,,,,,,,,,,,,,,,,,,,,,,,,,,,Document,,,,,,,,,,,,,,"Discursos i conferències",https://arxiupmaragall.catalunyaeuropa.net/files/original/21/930/0000000971.pdf,,"13. Expresident de la Generalitat de Catalunya",1,0
"El tema es Europa y las ciudades","Maragall, Pasqual, 1941-",,2008-10-22,Article,Textual,Castellà,Europa,"p. 19, Opinión","La Vanguardia",,,,,,,1556,,,,,,,,,,,,,,,,,,,,,,,,,,,20081022_LV.pdf,,,,,,,,,,,,,,,,,,,,,,,,,,,,,,,,,,,,,,,,,,,,,,,,,,,,,,,,,,,Document,,,"Activitat política",,,,,,,,,,,Articles,https://arxiupmaragall.catalunyaeuropa.net/files/original/23/785/20081022_LV.pdf,,"04.02. Activitat política",1,0
"Paraules de Pasqual Maragall a l’acte de lliurament de la Medalla d’Or de Turisme de Barcelona","Maragall, Pasqual, 1941-",,2008-10-13,Discurs,Textual,Català,"Homenatges i distincions",,,"L'alcalde Jordi Hereu va fer entrega a Maragall de la medalla d'Or de Turisme de Barcelona, en un acte que va tenir lloc a la Fundació Miró.","Fundació Miró (Barcelona)",,,,,,,,,,,,,,,,,,,,,,,,,,,,,,,,,,,,,,,,,,,,,,,,,,,,,,,,,,,,,,,,,,,,,,,,,,,,,,,,,,,,,,,,,,,Document,,,,,,,,,,,,,,"Discursos i conferències",https://arxiupmaragall.catalunyaeuropa.net/files/original/21/929/0000000965.pdf,,"13. Expresident de la Generalitat de Catalunya",1,0
"El principi de les euroregions i el seu sentit","Maragall, Pasqual, 1941-",,2008-10-10,Discurs,Textual,Català,Euroregió,,,"Participació a la Sessió Plenària ""L'Euroregió i integració"" del Grup Oncològic Català Occità (GOCO).","Hospital Durán i Reynals (L'Hospitalet de Llobregat)",,,,,,,,,,,,,,,,,,,,,,,,,,,,,,,,,,,,,,,,,,,,,,,,,,,,,,,,,,,,,,,,,,,,,,,,,,,,,,,,,,,,,,,,,,,Document,,,,,,,,,,,,,,"Discursos i conferències",https://arxiupmaragall.catalunyaeuropa.net/files/original/21/928/0000000964.pdf,,"13. Expresident de la Generalitat de Catalunya",1,0
"Monòver 1 - Eisenhower 0","Maragall, Pasqual, 1941-",,2008-09-21,Article,Textual,Català,Alzheimer,,"El Periódico de Catalunya",,,,,,,,,,,,,,,,,,,,,,,,,,,,,,,,,,,,,,,,,,,,,,,,,,,,,,,,,,,,,,,,,,,,,,,,,,,,,,,,,,,,,,,,,,,,,Document,,,,,,,,,,,,,,Articles,https://arxiupmaragall.catalunyaeuropa.net/files/original/21/1716/0000000961.pdf,,"13. Expresident de la Generalitat de Catalunya",1,0
