﻿"Dublin Core:Title","Dublin Core:Creator","Dublin Core:Contributor","Dublin Core:Date","Dublin Core:Type","Dublin Core:Format","Dublin Core:Language","Dublin Core:Subject","Dublin Core:Description","Dublin Core:Source","Dublin Core:Abstract","Dublin Core:Spatial Coverage","Dublin Core:Publisher","Dublin Core:Provenance","Dublin Core:Rights","Dublin Core:Relation","Dublin Core:Identifier","Dublin Core:Coverage","Dublin Core:Alternative Title","Dublin Core:Table Of Contents","Dublin Core:Date Available","Dublin Core:Date Created","Dublin Core:Date Accepted","Dublin Core:Date Copyrighted","Dublin Core:Date Submitted","Dublin Core:Date Issued","Dublin Core:Date Modified","Dublin Core:Date Valid","Dublin Core:Access Rights","Dublin Core:License","Dublin Core:Conforms To","Dublin Core:Has Format","Dublin Core:Has Part","Dublin Core:Has Version","Dublin Core:Is Format Of","Dublin Core:Is Part Of","Dublin Core:Is Referenced By","Dublin Core:Is Replaced By","Dublin Core:Is Required By","Dublin Core:Is Version Of","Dublin Core:References","Dublin Core:Replaces","Dublin Core:Requires","Dublin Core:Extent","Dublin Core:Medium","Dublin Core:Bibliographic Citation","Dublin Core:Temporal Coverage","Dublin Core:Accrual Method","Dublin Core:Accrual Periodicity","Dublin Core:Accrual Policy","Dublin Core:Audience","Dublin Core:Audience Education Level","Dublin Core:Mediator","Dublin Core:Instructional Method","Dublin Core:Rights Holder","Item Type Metadata:Text","Item Type Metadata:Interviewer","Item Type Metadata:Interviewee","Item Type Metadata:Location","Item Type Metadata:Transcription","Item Type Metadata:URL local","Item Type Metadata:Format original","Item Type Metadata:Dimensions físiques","Item Type Metadata:Duration","Item Type Metadata:Compression","Item Type Metadata:Producer","Item Type Metadata:Director","Item Type Metadata:Bit Rate/Frequency","Item Type Metadata:Time Summary","Item Type Metadata:Email Body","Item Type Metadata:Subject Line","Item Type Metadata:From","Item Type Metadata:To","Item Type Metadata:CC","Item Type Metadata:BCC","Item Type Metadata:Number of Attachments","Item Type Metadata:Standards","Item Type Metadata:Objectives","Item Type Metadata:Materials","Item Type Metadata:Lesson Plan Text","Item Type Metadata:URL","Item Type Metadata:Event Type","Item Type Metadata:Participants","Item Type Metadata:Birth Date","Item Type Metadata:Birthplace","Item Type Metadata:Death Date","Item Type Metadata:Occupation","Item Type Metadata:Biographical Text","Item Type Metadata:Bibliography","Item Type Metadata:Edition Statement","Item Type Metadata:Publication Statement","Item Type Metadata:Note statement","Item Type Metadata:Profile description : Creation","Item Type Metadata:Profile description : Descriptive Rules","Item Type Metadata:Profile description : Language Usage","Item Type Metadata:Revision Description : Change","Item Type Metadata:Revision Description : List","Item Type Metadata:Front matter : Title page","Item Type Metadata:Front matter : Division","Item Type Metadata:Destinatari","Item Type Metadata:Número de caixa","Item Type Metadata:Localització de la caixa","EAD Archive:Level","EAD Archive:Arrangement","EAD Archive:Descriptive Identification : Heading","EAD Archive:Descriptive Identification : Note","EAD Archive:Appraisal Information","EAD Archive:Biography or History","EAD Archive:Index","EAD Archive:Note","EAD Archive:Other Descriptive Data","EAD Archive:Processing Information","EAD Archive:Scope and Content","EAD Archive:Heading","EAD Archive:Table Head","PDF Text:Text",tags,file,itemType,collection,public,featured
"A Espanya no s'admet que els catalans manin","Perdigó, Joan Manuel",,2004-07-18,Entrevista,Textual,Català,Govern,,"El Periódico",,,,,,,,,,,,,,,,,,,,,,,,,,,,,,,,,,,,,,,,,,,,,,,,,,,,,,,,,,,,,,,,,,,,,,,,,,,,,,,,,,,,,,,,,,,,,Document,,,,,,,,,,,,,,Entrevistes,https://arxiupmaragall.catalunyaeuropa.net/files/original/27/1589/0000000752.pdf,,"12.01. Activitat de representació (com a President)",1,0
"Aquesta legislatura tindrem un nou finançament amb Agència Tributària","Xargayó, Jordi",,2004-05-02,Entrevista,Textual,Català,Finançament,,"Diari de Girona",,,,,,,,,,,,,,,,,,,,,,,,,,,,,,,,,,,,,,,,,,,,,,,,,,,,,,,,,,,,,,,,,,,,,,,,,,,,,,,,,,,,,,,,,,,,,Document,,,,,,,,,,,,,,Entrevistes,https://arxiupmaragall.catalunyaeuropa.net/files/original/27/1583/0000000746.pdf,,"12.01. Activitat de representació (com a President)",1,0
"Bargalló té un perfil més adequat com a conseller en cap","Busquets, Jordi",,2004-02-29,Entrevista,Textual,Català,Govern,,"El Punt",,,,,,,,,,,,,,,,,,,,,,,,,,,,,,,,,,,,,,,,,,,,,,,,,,,,,,,,,,,,,,,,,,,,,,,,,,,,,,,,,,,,,,,,,,,,,Document,,,,,,,,,,,,,,Entrevistes,https://arxiupmaragall.catalunyaeuropa.net/files/original/27/1575/0000000739.pdf,,"12.01. Activitat de representació (com a President)",1,0
"Cal controlar la frontera i evitar els guetos als barris","Sáez, Albert",,2002-06-09,Entrevista,Textual,Català,Oposició,,Avui,,,,,,,,,,,,,,,,,,,,,,,,,,,,,,,,,,,,,,,,,,,,,,,,,,,,,,,,,,,,,,,,,,,,,,,,,,,,,,,,,,,,,,,,,,,,,Document,,,,,,,,,,,,,,Entrevistes,https://arxiupmaragall.catalunyaeuropa.net/files/original/23/1550/0000000723.pdf,,"04.02. Activitat política",1,0
"Celebramos el futuro, no el pasado","Arroyo, Francesc",,2002-07-26,Entrevista,Textual,Castellà,Commemoracions,"10è aniversari de la celebració dels Jocs Olímpics de Barcelona 1992.","El País",,,,,,,,,,,,,,,,,,,,,,,,,,,,,,,,,,,,,,,,,,,,,,,,,,,,,,,,,,,,,,,,,,,,,,,,,,,,,,,,,,,,,,,,,,,,,Document,,,,,,,,,,,,,,Entrevistes,https://arxiupmaragall.catalunyaeuropa.net/files/original/23/1554/0000000794.pdf,,"04.02. Activitat política",1,0
"CiU s'ha dedicat sense escrúpols a assegurar-se el futur més com a partit que com a govern","Busquets, Jordi",,2003-05-11,Entrevista,Textual,Català,"Convergència i Unió",,"El Punt",,,,,,,,,,,,,,,,,,,,,,,,,,,,,,,,,,,,,,,,,,,,,,,,,,,,,,,,,,,,,,,,,,,,,,,,,,,,,,,,,,,,,,,,,,,,,Document,,,,,,,,,,,,,,Entrevistes,https://arxiupmaragall.catalunyaeuropa.net/files/original/23/1567/0000000796.pdf,,"04.02. Activitat política",1,0
"Descarto pactar amb CiU després d'una legislatura tan agònica com aquesta","González, David",,2003-05-04,Entrevista,Textual,Català,Oposició,,Avui,,,,,,,,,,,,,,,,,,,,,,,,,,,,,,,,,,,,,,,,,,,,,,,,,,,,,,,,,,,,,,,,,,,,,,,,,,,,,,,,,,,,,,,,,,,,,Document,,,,,,,,,,,,,,Entrevistes,https://arxiupmaragall.catalunyaeuropa.net/files/original/23/1566/0000000797.pdf,,"04.02. Activitat política",1,0
"El Estatut será la primera ley fundamental que cambiará","Antich, José",,2004-04-23,Entrevista,Textual,Castellà,Govern,,"La Vanguardia",,,,,,,,,,,,,,,,,,,,,,,,,,,,,,,,,,,,,,,,,,,,,,,,,,,,,,,,,,,,,,,,,,,,,,,,,,,,,,,,,,,,,,,,,,,,,Document,,,,,,,,,,,,,,Entrevistes,https://arxiupmaragall.catalunyaeuropa.net/files/original/27/1581/0000000744.pdf,,"12.01. Activitat de representació (com a President)",1,0
"El Fòrum tiene sentido","Madueño, Eugeni",,2002-05-18,Entrevista,Textual,Castellà,"Fòrum de les Cultures Barcelona 2004",,"La Vanguardia",,,,,,,,,,,,,,,,,,,,,,,,,,,,,,,,,,,,,,,,,,,,,,,,,,,,,,,,,,,,,,,,,,,,,,,,,,,,,,,,,,,,,,,,,,,,,Document,,,,,,,,,,,,,,Entrevistes,https://arxiupmaragall.catalunyaeuropa.net/files/original/23/1549/0000000801.pdf,,"04.02. Activitat política",1,0
"El Govern va millorar després de la marxa de Carod perquè havia superat un problema seriós","Pastor, Carles",,2004-03-28,Entrevista,Textual,Català,Estatut,,"El Periódico",,,,,,,,,,,,,,,,,,,,,,,,,,,,,,,,,,,,,,,,,,,,,,,,,,,,,,,,,,,,,,,,,,,,,,,,,,,,,,,,,,,,,,,,,,,,,Document,,,,,,,,,,,,,,Entrevistes,https://arxiupmaragall.catalunyaeuropa.net/files/original/27/1579/0000000742.pdf,,"12.01. Activitat de representació (com a President)",1,0
